Target
Phosphatidylinositol 4,5-bisphosphate 3-kinase catalytic subunit delta isoform
Ligand
BDBM341253
Substrate
Meas. Tech.
TR-FRET assay
IC50
61.0±n/a nM
Citation
 Evarts, JKaplan, JKim, MNaduthambi, DPatel, LPerreault, SPhillips, GPurvis, II, LJStevens, KLTreiberg, JA Phosphatidylinositol 3-kinase inhibitors US Patent  US9765060 Publication Date 9/19/2017 
Target
Name:
Phosphatidylinositol 4,5-bisphosphate 3-kinase catalytic subunit delta isoform
Synonyms:
PI3-kinase p110 subunit delta PI3-kinase subunit p110-delta PIK3CD Phosphatidylinositol 4,5-biphosphate 3-kinase catalytic subunit delta (PIK3CD) Phosphatidylinositol 4,5-bisphosphate 3-kinase 110 kDa catalytic subunit delta (PI3K delta) Phosphatidylinositol 4,5-bisphosphate 3-kinase catalytic subunit delta (PI3Kdelta) Phosphatidylinositol 4,5-bisphosphate 3-kinase catalytic subunit delta isoform (PI3K delta) Phosphatidylinositol 4,5-bisphosphate 3-kinase catalytic subunit delta isoform (PI3K-delta) Phosphatidylinositol 4,5-bisphosphate 3-kinase catalytic subunit delta isoform (PI3Kdelta)
Type:
Enzyme Subunit
Mol. Mass.:
119489.41
Organism:
Homo sapiens (Human)
Description:
O00329
Residue:
1044
  
Inhibitor
Name:
BDBM341253
Synonyms:
(S)-2,4-diamino-6-((1-(5-(cyclopentylsulfonyl)-3-(3-fluorophenyl)-4-oxo-3,4-dihydroquinazolin-2-yl)ethyl)amino)pyrimidine-5-carbonitrile | US9765060, Compound 80
Type:
Small organic molecule
Emp. Form.:
C26H25FN8O3S
Mol. Mass.:
548.592
SMILES:
C[C@H](Nc1nc(N)nc(N)c1C#N)c1nc2cccc(c2c(=O)n1-c1cccc(F)c1)S(=O)(=O)C1CCCC1
: