Target
Cyclin-dependent kinase 4/G1/S-specific cyclin-D1
Ligand
BDBM253929
Substrate
Meas. Tech.
Caliper Assay
IC50
0.7±n/a nM
Citation
 Strum, JCBisi, JERoberts, PJTavares, FX HSPC-sparing treatments for RB-positive abnormal cellular proliferation US Patent  US9527857 Publication Date 12/27/2016 
Target
Name:
Cyclin-dependent kinase 4/G1/S-specific cyclin-D1
Synonyms:
CDK4/CycD CDK4/Cyclin D1 Cyclin-Dependent Kinase 4 (CDK4) Cyclin-dependent kinase 4/G1/S-specific cyclin D1 | Cyclin-dependent kinase 4/cyclin D1
Type:
Protein Complex
Mol. Mass.:
Description:
CDK4/D1 complexes were purified from insect cells co-infected with baculovirus vectors containing each of the components.
Components:
This complex has 2 components.
Component 1
Name:
Cyclin-dependent kinase 4
Synonyms:
CDK4 Cell division protein kinase 4 PSK-J3
Type:
Enzyme Subunit
Mol. Mass.:
33731.96
Organism:
Homo sapiens (Human)
Description:
P11802
Residue:
303
  
Component 2
Name:
G1/S-specific cyclin-D1
Synonyms:
B-cell lymphoma 1 protein BCL-1 oncogene CCND1 PRAD1 | PRAD1 oncogene
Type:
Enzyme Subunit
Mol. Mass.:
33717.70
Organism:
Homo sapiens (Human)
Description:
Residue:
295
  
Inhibitor
Name:
BDBM253929
Synonyms:
US9464092, U | US9527857, U
Type:
Small organic molecule
Emp. Form.:
C28H36N8O2
Mol. Mass.:
516.6378
SMILES:
O=C1NCC2(CCCCC2)n2c1cc1cnc(Nc3ccc(cn3)N3CCC(CC3)N3CCOCC3)nc21
: