Target
Protein arginine N-methyltransferase 5
Ligand
BDBM337001
Substrate
Meas. Tech.
Biochemical Assay
IC50
<100±n/a nM
Citation
 Duncan, KWChesworth, RBoriack-Sjodin, PAMunchhof, MJJin, L PRMT5 inhibitors and uses thereof US Patent  US9765068 Publication Date 9/19/2017 
Target
Name:
Protein arginine N-methyltransferase 5
Synonyms:
72 kDa ICln-binding protein HRMT1L5 IBP72 Jak-binding protein 1 PRMT5/MEP50 complex Protein arginine methyltransferase 5 (PRMT5) SKB1 homolog Shk1 kinase-binding protein 1 homolog
Type:
Enzyme
Mol. Mass.:
72679.99
Organism:
Homo sapiens (Human)
Description:
O14744
Residue:
637
  
Inhibitor
Name:
BDBM337001
Synonyms:
US9745291, Compound 47 | US9765068, Compound 47
Type:
Small organic molecule
Emp. Form.:
C21H26N2O5S
Mol. Mass.:
418.507
SMILES:
CS(=O)(=O)c1cccc(OCC(=O)NCC(O)CN2CCc3ccccc3C2)c1
: