Target
Protein arginine N-methyltransferase 5
Ligand
BDBM337012
Substrate
Meas. Tech.
Biochemical Assay
IC50
30000±n/a nM
Citation
 Duncan, KWChesworth, RBoriack-Sjodin, PAMunchhof, MJJin, L PRMT5 inhibitors and uses thereof US Patent  US9765068 Publication Date 9/19/2017 
Target
Name:
Protein arginine N-methyltransferase 5
Synonyms:
72 kDa ICln-binding protein HRMT1L5 IBP72 Jak-binding protein 1 PRMT5/MEP50 complex Protein arginine methyltransferase 5 (PRMT5) SKB1 homolog Shk1 kinase-binding protein 1 homolog
Type:
Enzyme
Mol. Mass.:
72679.99
Organism:
Homo sapiens (Human)
Description:
O14744
Residue:
637
  
Inhibitor
Name:
BDBM337012
Synonyms:
US9745291, Compound 58 | US9765068, Compound 58
Type:
Small organic molecule
Emp. Form.:
C20H30N2O2
Mol. Mass.:
330.4644
SMILES:
O[C@H](CNC(=O)CC1CCCCC1)CN1CCc2ccccc2C1
: