Target
Protein arginine N-methyltransferase 5
Ligand
BDBM337038
Substrate
Meas. Tech.
Biochemical Assay
IC50
<100±n/a nM
Citation
 Duncan, KWChesworth, RBoriack-Sjodin, PAMunchhof, MJJin, L PRMT5 inhibitors and uses thereof US Patent  US9765068 Publication Date 9/19/2017 
Target
Name:
Protein arginine N-methyltransferase 5
Synonyms:
72 kDa ICln-binding protein HRMT1L5 IBP72 Jak-binding protein 1 PRMT5/MEP50 complex Protein arginine methyltransferase 5 (PRMT5) SKB1 homolog Shk1 kinase-binding protein 1 homolog
Type:
Enzyme
Mol. Mass.:
72679.99
Organism:
Homo sapiens (Human)
Description:
O14744
Residue:
637
  
Inhibitor
Name:
BDBM337038
Synonyms:
US9745291, Compound 84 | US9765068, Compound 84
Type:
Small organic molecule
Emp. Form.:
C25H34N4O3
Mol. Mass.:
438.5625
SMILES:
CN1CCN(CC1)c1ccccc1OCC(=O)NC[C@H](O)CN1CCc2ccccc2C1
: