Target
Tryptase beta-2
Ligand
BDBM14312
Substrate
BDBM12679
Meas. Tech.
Enzyme Assay and Determination of the Inhibition Constants
Ki
3±n/a nM
Citation
 McGrath, MESprengeler, PAHirschbein, BSomoza, JRLehoux, IJanc, JWGjerstad, EGraupe, MEstiarte, AVenkataramani, CLiu, YYee, RHo, JDGreen, MJLee, CSLiu, LTai, VSpencer, JSperandio, DKatz, BA Structure-guided design of peptide-based tryptase inhibitors. Biochemistry 45:5964-73 (2006)  
Target
Name:
Tryptase beta-2
Synonyms:
TPS2 TRYB2_HUMAN Tryptase II Tryptase-2
Type:
PROTEIN
Mol. Mass.:
30518.79
Organism:
Homo sapiens (Human)
Description:
ChEMBL_210702
Residue:
275
  
Inhibitor
Name:
BDBM14312
Synonyms:
CHEMBL214368 ethyl N-[(2S)-6-amino-1-(5-{[4-(2,3-dihydro-1H-inden-2-ylcarbamoyl)phenyl]methyl}-1,2,4-oxadiazol-3-yl)-1-oxohexan-2-yl]carbamate
Type:
Small organic molecule
Emp. Form.:
C28H33N5O5
Mol. Mass.:
519.5921
SMILES:
CCOC(=O)N[C@@H](CCCCN)C(=O)c1noc(Cc2ccc(cc2)C(=O)NC2Cc3ccccc3C2)n1
:
Substrate
Name:
BDBM12679
Synonyms:
BDBM13790 Chromogenic Substrate
Type:
Small organic molecule
Emp. Form.:
C26H34N6O7S
Mol. Mass.:
574.649
SMILES:
Cc1ccc(cc1)S(=O)(=O)NCC(=O)N1CCCC1C(=O)NC(CCCCN)C(=O)Nc1ccc(cc1)[N+]([O-])=O
: