Target
Coagulation factor XI
Ligand
BDBM341308
Substrate
Meas. Tech.
Biochemical Assay
IC50
20.0±n/a nM
Citation
 Röhrig, SHillisch, AStrassburger, JHeitmeier, SSchmidt, MVSchlemmer, KTersteegen, ABuchmüller, AGerdes, CSchäfer, MTeller, HJimenez Nunez, ESchirok, HKlar, J Substituted oxopyridine derivatives US Patent  US9765070 Publication Date 9/19/2017 
Target
Name:
Coagulation factor XI
Synonyms:
Coagulation factor XIa Coagulation factor XIa light chain FA11_HUMAN Factor XIa PTA | Plasma thromboplastin antecedent
Type:
Enzyme
Mol. Mass.:
70130.58
Organism:
Homo sapiens (Human)
Description:
P03951
Residue:
625
  
Inhibitor
Name:
BDBM341308
Synonyms:
2-[4-(5-Chloro-2-cyanophenyl)-5-methoxy-2-oxopyridin-1(2H)-yl]-N-{3-[(dimethylamino)-methyl][1,2,4]triazolo[4,3-a]pyridin-6-yl}-4-methoxybutanamide (racemate) | US9765070, Example 25
Type:
Small organic molecule
Emp. Form.:
C27H28ClN7O4
Mol. Mass.:
550.009
SMILES:
COCCC(C(=O)Nc1ccc2nnc(CN(C)C)n2c1)n1cc(OC)c(cc1=O)-c1cc(Cl)ccc1C#N
: