Target
Plasma kallikrein
Ligand
BDBM341303
Substrate
Meas. Tech.
Biochemical Assay
IC50
23.0±n/a nM
Citation
 Röhrig, SHillisch, AStrassburger, JHeitmeier, SSchmidt, MVSchlemmer, KTersteegen, ABuchmüller, AGerdes, CSchäfer, MTeller, HJimenez Nunez, ESchirok, HKlar, J Substituted oxopyridine derivatives US Patent  US9765070 Publication Date 9/19/2017 
Target
Name:
Plasma kallikrein
Synonyms:
Fletcher factor KLKB1 Kallikrein Plasma kallikrein heavy chain Plasma prekallikrein
Type:
Protein
Mol. Mass.:
71391.16
Organism:
Homo sapiens (Human)
Description:
P03952
Residue:
638
  
Inhibitor
Name:
BDBM341303
Synonyms:
2-[4-(5-Chloro-2-cyanophenyl)-5-methoxy-2-oxopyridin-1(2H)-yl]-N-([1,2,4]triazolo[4,3-a]pyridin-6-yl)butanamide (racemate) | US9765070, Example 20
Type:
Small organic molecule
Emp. Form.:
C23H19ClN6O3
Mol. Mass.:
462.888
SMILES:
CCC(C(=O)Nc1ccc2nncn2c1)n1cc(OC)c(cc1=O)-c1cc(Cl)ccc1C#N
: