Target
Tryptophan 5-hydroxylase 1
Ligand
BDBM341380
Substrate
Meas. Tech.
Biochemical In Vitro Assay
IC50
25.0±n/a nM
Citation
 Bur, DGrisostomi, CNayler, ORemen, LVercauteren, MWelford, R Tricyclic piperidine compounds US Patent  US9765092 Publication Date 9/19/2017 
Target
Name:
Tryptophan 5-hydroxylase 1
Synonyms:
TPH TPH1_HUMAN TRPH | Tryptophan 5-monooxygenase 1
Type:
PROTEIN
Mol. Mass.:
50990.64
Organism:
Homo sapiens (Human)
Description:
ChEMBL_1361824
Residue:
444
  
Inhibitor
Name:
BDBM341380
Synonyms:
1-(5-(4-cyclopropyl-2-fluorophenyl)-2-methyl-7,8-dihydro-[1,3,4]thiadiazolo[2',3':2,3]imidazo[4,5-c]pyridin-6(5H)-yl)-2-((2-methylpyridin-3-yl)oxy)ethanone | US9765092, Example 1.6.6
Type:
Small organic molecule
Emp. Form.:
C25H24FN5O2S
Mol. Mass.:
477.554
SMILES:
Cc1nn2c3C(N(CCc3nc2s1)C(=O)COc1cccnc1C)c1ccc(cc1F)C1CC1
: