Target
Tryptophan 5-hydroxylase 1
Ligand
BDBM341391
Substrate
Meas. Tech.
Biochemical In Vitro Assay
IC50
3.00±n/a nM
Citation
 Bur, DGrisostomi, CNayler, ORemen, LVercauteren, MWelford, R Tricyclic piperidine compounds US Patent  US9765092 Publication Date 9/19/2017 
Target
Name:
Tryptophan 5-hydroxylase 1
Synonyms:
TPH TPH1_HUMAN TRPH | Tryptophan 5-monooxygenase 1
Type:
PROTEIN
Mol. Mass.:
50990.64
Organism:
Homo sapiens (Human)
Description:
ChEMBL_1361824
Residue:
444
  
Inhibitor
Name:
BDBM341391
Synonyms:
2-((2-chloro-6-morpholinopyridin-3-yl)oxy)-1-(5-(4-cyclopropyl-2-fluorophenyl)-2-methyl-7,8-dihydro-[1,3,4]thiadiazolo[2',3':2,3]imidazo[4,5-c]pyridin-6(5H)-yl)ethanone | US9765092, Example 1.6.17
Type:
Small organic molecule
Emp. Form.:
C28H28ClFN6O3S
Mol. Mass.:
583.077
SMILES:
Cc1nn2c3C(N(CCc3nc2s1)C(=O)COc1ccc(nc1Cl)N1CCOCC1)c1ccc(cc1F)C1CC1
: