Target
Tryptophan 5-hydroxylase 1
Ligand
BDBM341612
Substrate
Meas. Tech.
Biochemical In Vitro Assay
IC50
13.0±n/a nM
Citation
 Bur, DGrisostomi, CNayler, ORemen, LVercauteren, MWelford, R Tricyclic piperidine compounds US Patent  US9765092 Publication Date 9/19/2017 
Target
Name:
Tryptophan 5-hydroxylase 1
Synonyms:
TPH TPH1_HUMAN TRPH | Tryptophan 5-monooxygenase 1
Type:
PROTEIN
Mol. Mass.:
50990.64
Organism:
Homo sapiens (Human)
Description:
ChEMBL_1361824
Residue:
444
  
Inhibitor
Name:
BDBM341612
Synonyms:
2-((6-(1,1-dioxidoisothiazolidin-2-yl)-2-ethylpyridin-3-yl)oxy)-1-(5-(3-fluoro-5-methylpyridin-2-yl)-2-(trifluoromethyl)-7,8-dihydro-[1,3,4]thiadiazolo[2',3':2,3]imidazo[4,5-c]pyridin-6(5H)-yl)ethanone | US9765092, Example 5.2.1
Type:
Small organic molecule
Emp. Form.:
C26H25F4N7O4S2
Mol. Mass.:
639.645
SMILES:
CCc1nc(ccc1OCC(=O)N1CCc2nc3sc(nn3c2C1c1ncc(C)cc1F)C(F)(F)F)N1CCCS1(=O)=O
: