Target
Tryptophan 5-hydroxylase 1
Ligand
BDBM341709
Substrate
Meas. Tech.
Biochemical In Vitro Assay
IC50
5.00±n/a nM
Citation
 Bur, DGrisostomi, CNayler, ORemen, LVercauteren, MWelford, R Tricyclic piperidine compounds US Patent  US9765092 Publication Date 9/19/2017 
Target
Name:
Tryptophan 5-hydroxylase 1
Synonyms:
TPH TPH1_HUMAN TRPH | Tryptophan 5-monooxygenase 1
Type:
PROTEIN
Mol. Mass.:
50990.64
Organism:
Homo sapiens (Human)
Description:
ChEMBL_1361824
Residue:
444
  
Inhibitor
Name:
BDBM341709
Synonyms:
1-(5-(4-Chloro-2-fluorophenyl)-2-methyl-7,8-dihydro-[1,3,4]thiadiazolo[2',3':2,3]imidazo[4,5-c]pyridin-6(5H)-yl)-2-((2-chloro-6-((2-hydroxyethyl)-(methyl)amino)pyridin-3-yl)oxy)ethanone | US9765092, Example 1.4.13
Type:
Small organic molecule
Emp. Form.:
C24H23Cl2FN6O3S
Mol. Mass.:
565.447
SMILES:
CN(CCO)c1ccc(OCC(=O)N2CCc3nc4sc(C)nn4c3C2c2ccc(Cl)cc2F)c(Cl)n1
: