Target
Large neutral amino acids transporter small subunit 2
Ligand
BDBM340549
Substrate
IC50
357000±n/a nM
Citation
 Kanai, YNagamori, SKitaura, YNeya, MMatsushita, N Phenoxyalkylamine compound US Patent  US9771316 Publication Date 9/26/2017 
Target
Name:
Large neutral amino acids transporter small subunit 2
Synonyms:
LAT2 SLC7A8
Type:
Protein
Mol. Mass.:
58378.41
Organism:
Homo sapiens (Human)
Description:
Q9UHI5
Residue:
535
  
Inhibitor
Name:
BDBM340549
Synonyms:
US9771316, Example 48
Type:
Small organic molecule
Emp. Form.:
C16H18F3NOS
Mol. Mass.:
329.38
SMILES:
NCCCCC(Oc1ccc(cc1)C(F)(F)F)c1cccs1
: