Target
Large neutral amino acids transporter small subunit 2
Ligand
BDBM340671
Substrate
IC50
53000±n/a nM
Citation
 Kanai, YNagamori, SKitaura, YNeya, MMatsushita, N Phenoxyalkylamine compound US Patent  US9771316 Publication Date 9/26/2017 
Target
Name:
Large neutral amino acids transporter small subunit 2
Synonyms:
LAT2 SLC7A8
Type:
Protein
Mol. Mass.:
58378.41
Organism:
Homo sapiens (Human)
Description:
Q9UHI5
Residue:
535
  
Inhibitor
Name:
BDBM340671
Synonyms:
US9771316, Example 69
Type:
Small organic molecule
Emp. Form.:
C18H19F4NO
Mol. Mass.:
341.3432
SMILES:
NCCCC[C@H](Oc1ccc(c(F)c1)C(F)(F)F)c1ccccc1
: