Target
Coagulation factor X
Ligand
BDBM14348
Substrate
BDBM13950
Meas. Tech.
Enzyme Assay and Determination of the Inhibition Constants
Ki
64±n/a nM
Citation
 Katz, BAElrod, KVerner, EMackman, RLLuong, CShrader, WDSendzik, MSpencer, JRSprengeler, PAKolesnikov, ATai, VWHui, HCBreitenbucher, JGAllen, DJanc, JW Elaborate manifold of short hydrogen bond arrays mediating binding of active site-directed serine protease inhibitors. J Mol Biol 329:93-120 (2003)  
Target
Name:
Coagulation factor X
Synonyms:
Activated coagulation factor X (FXa) Coagulation factor X precursor F10 Factor X heavy chain Factor Xa Stuart-Prower factor
Type:
Enzyme
Mol. Mass.:
54726.60
Organism:
Homo sapiens (Human)
Description:
Residue:
488
  
Inhibitor
Name:
BDBM14348
Synonyms:
2-{5-[amino(iminiumyl)methyl]-1H-indol-2-yl}-6-chloro-4-methylbenzen-1-olate | CRA-9462
Type:
Small organic molecule
Emp. Form.:
C16H14ClN3O
Mol. Mass.:
299.755
SMILES:
Cc1cc(Cl)c([O-])c(c1)-c1cc2cc(ccc2[nH]1)C(N)=[NH2+]
:
Substrate
Name:
BDBM13950
Synonyms:
(2S)-N-({[(1S)-4-carbamimidamido-1-[(4-nitrophenyl)carbamoyl]butyl]carbamoyl}methyl)-2-acetamidohexanamide Factor Xa (fXa) Chromogenic Substrate
Type:
Emp. Form.:
Mol. Mass.:
SMILES:
: