Target
Nuclear receptor ROR-gamma
Ligand
BDBM340688
Substrate
Meas. Tech.
SPA Binding Assay
IC50
44.0±n/a nM
Citation
 Duan, JDhar, TGJiang, BLu, ZKarmakar, AGupta, AKWeigelt, CA Carbocyclic sulfone RORγ modulators US Patent  US9771320 Publication Date 9/26/2017 
Target
Name:
Nuclear receptor ROR-gamma
Synonyms:
NR1F3 Nuclear receptor ROR-gamma (RORC) RAR-related orphan receptor C (RORc) RORG RZRG Retinoid-related orphan receptor-gamma (RORc)
Type:
Enzyme Catalytic Domain
Mol. Mass.:
58218.40
Organism:
Homo sapiens (Human)
Description:
P51449
Residue:
518
  
Inhibitor
Name:
BDBM340688
Synonyms:
1-(2-(benzyloxy)-1,1,1,3,3,3-hexafluoropropan-2-yl)-4-(1-((4-fluorophenyl)sulfonyl)cyclopentyl)benzene | US9771320, Example 4
Type:
Small organic molecule
Emp. Form.:
C27H23F7O3S
Mol. Mass.:
560.524
SMILES:
Fc1ccc(cc1)S(=O)(=O)C1(CCCC1)c1ccc(cc1)C(OCc1ccccc1)(C(F)(F)F)C(F)(F)F
: