Target
Nuclear receptor ROR-gamma
Ligand
BDBM341803
Substrate
Meas. Tech.
SPA Binding Assay
IC50
36.0±n/a nM
Citation
 Duan, JDhar, TGJiang, BLu, ZKarmakar, AGupta, AKWeigelt, CA Carbocyclic sulfone RORγ modulators US Patent  US9771320 Publication Date 9/26/2017 
Target
Name:
Nuclear receptor ROR-gamma
Synonyms:
NR1F3 Nuclear receptor ROR-gamma (RORC) RAR-related orphan receptor C (RORc) RORG RZRG Retinoid-related orphan receptor-gamma (RORc)
Type:
Enzyme Catalytic Domain
Mol. Mass.:
58218.40
Organism:
Homo sapiens (Human)
Description:
P51449
Residue:
518
  
Inhibitor
Name:
BDBM341803
Synonyms:
1,3-difluoro-2-(((1,1,1,3,3,3-hexafluoro-2-(4-(1-((4-fluorophenyl)sulfonyl)-3-methylenecyclobutyl)phenyl)propan-2-yl)oxy)methyl)benzene | US9771320, Example 40
Type:
Small organic molecule
Emp. Form.:
C27H19F9O3S
Mol. Mass.:
594.489
SMILES:
Fc1ccc(cc1)S(=O)(=O)C1(CC(=C)C1)c1ccc(cc1)C(OCc1c(F)cccc1F)(C(F)(F)F)C(F)(F)F
: