Target
Nuclear receptor ROR-gamma
Ligand
BDBM341962
Substrate
Meas. Tech.
SPA Binding Assay
IC50
356±n/a nM
Citation
 Duan, JDhar, TGJiang, BLu, ZKarmakar, AGupta, AKWeigelt, CA Carbocyclic sulfone RORγ modulators US Patent  US9771320 Publication Date 9/26/2017 
Target
Name:
Nuclear receptor ROR-gamma
Synonyms:
NR1F3 Nuclear receptor ROR-gamma (RORC) RAR-related orphan receptor C (RORc) RORG RZRG Retinoid-related orphan receptor-gamma (RORc)
Type:
Enzyme Catalytic Domain
Mol. Mass.:
58218.40
Organism:
Homo sapiens (Human)
Description:
P51449
Residue:
518
  
Inhibitor
Name:
BDBM341962
Synonyms:
US9771320, Example 196 | US9771320, Example 197
Type:
Small organic molecule
Emp. Form.:
C33H30F9NO5S
Mol. Mass.:
723.646
SMILES:
Fc1ccc(cc1)S(=O)(=O)C1(CCC(C1)NC(=O)C1CCOCC1)c1ccc(cc1)C(OCc1c(F)cccc1F)(C(F)(F)F)C(F)(F)F
: