Target
Lysine-specific histone demethylase 1A
Ligand
BDBM289954
Substrate
Meas. Tech.
In Vitro Enzyme Inhibition Assay
IC50
<100±n/a nM
Citation
 Chen, YKKanouni, TKaldor, SWStafford, JAVeal, JM Inhibitors of lysine specific demethylase-1 US Patent  US9771329 Publication Date 9/26/2017 
Target
Name:
Lysine-specific histone demethylase 1A
Synonyms:
AOF2 Flavin-containing amine oxidase domain-containing protein 2 KDM1A KIAA0601 Lysine-specific demethylase 1 (LSD1) Lysine-specific histone demethylase 1 (LSD1)
Type:
Enzyme
Mol. Mass.:
92901.01
Organism:
Homo sapiens (Human)
Description:
O60341
Residue:
852
  
Inhibitor
Name:
BDBM289954
Synonyms:
4-[2-(4-aminopiperidin- 1-yl)-5-[4-(2- hydroxyethoxy)phenyl]- 1-methyl-6-oxopyrimidin- 4-yl]benzonitrile US10328077, Example 97 US10849898, Example 97 US11084793, Example 97 US9771329, Example 97 | US9776974, Example 97
Type:
Small organic molecule
Emp. Form.:
C25H27N5O3
Mol. Mass.:
445.5136
SMILES:
Cn1c(nc(-c2ccc(cc2)C#N)c(-c2ccc(OCCO)cc2)c1=O)N1CCC(N)CC1
: