Target
Lysine-specific histone demethylase 1A
Ligand
BDBM283341
Substrate
Meas. Tech.
In Vitro Enzyme Inhibition Assay
IC50
550±n/a nM
Citation
 Chen, YKKanouni, TKaldor, SWStafford, JAVeal, JM Inhibitors of lysine specific demethylase-1 US Patent  US9771329 Publication Date 9/26/2017 
Target
Name:
Lysine-specific histone demethylase 1A
Synonyms:
AOF2 Flavin-containing amine oxidase domain-containing protein 2 KDM1A KIAA0601 Lysine-specific demethylase 1 (LSD1) Lysine-specific histone demethylase 1 (LSD1)
Type:
Enzyme
Mol. Mass.:
92901.01
Organism:
Homo sapiens (Human)
Description:
O60341
Residue:
852
  
Inhibitor
Name:
BDBM283341
Synonyms:
2-(4-amino-piperidin-1-yl)-3- methyl-5-(1-methyl-1H-indol-5- yl)-6-pyridin-4-yl-3H- pyrimidin-4-one US10207999, Example 116 US10548896, Example 116 US10960005, Example 116 US9573930, Example 116 US9776974, Example 116
Type:
Small organic molecule
Emp. Form.:
C24H26N6O
Mol. Mass.:
414.5028
SMILES:
Cn1ccc2cc(ccc12)-c1c(nc(N2CCC(N)CC2)n(C)c1=O)-c1ccncc1
: