Target
Lysine-specific histone demethylase 1A
Ligand
BDBM283231
Substrate
Meas. Tech.
In Vitro Enzyme Inhibition Assay
IC50
550±n/a nM
Citation
 Chen, YKKanouni, TKaldor, SWStafford, JAVeal, JM Inhibitors of lysine specific demethylase-1 US Patent  US9771329 Publication Date 9/26/2017 
Target
Name:
Lysine-specific histone demethylase 1A
Synonyms:
AOF2 Flavin-containing amine oxidase domain-containing protein 2 KDM1A KIAA0601 Lysine-specific demethylase 1 (LSD1) Lysine-specific histone demethylase 1 (LSD1)
Type:
Enzyme
Mol. Mass.:
92901.01
Organism:
Homo sapiens (Human)
Description:
O60341
Residue:
852
  
Inhibitor
Name:
BDBM283231
Synonyms:
2-(4-amino-piperidin-1-yl)-4-(4- cyano-3-fluoro-phenyl)-1-methyl- 6-oxo-1,6-dihydro-pyrimidine-5- carbonitrile US10023543, Example 19 US10328077, Example 19 US10849898, Example 121 US11084793, Example 121 US9771329, Example 121 | US9776974, Example 121
Type:
Small organic molecule
Emp. Form.:
C18H17FN6O
Mol. Mass.:
352.3656
SMILES:
Cn1c(nc(-c2ccc(C#N)c(F)c2)c(C#N)c1=O)N1CCC(N)CC1
: