Target
Tyrosine-protein kinase SYK
Ligand
BDBM342102
Substrate
Meas. Tech.
Enzyme Inhibition
IC50
543±n/a nM
Citation
 Fyfe, MC Kinase inhibitors based upon N-alkyl pyrazoles US Patent  US9771353 Publication Date 9/26/2017 
Target
Name:
Tyrosine-protein kinase SYK
Synonyms:
KSYK_HUMAN Spleen Tyrosine Kinase Tyrosine-protein kinase SYK (Syk)
Type:
Enzyme
Mol. Mass.:
72079.99
Organism:
Homo sapiens (Human)
Description:
P43405
Residue:
635
  
Inhibitor
Name:
BDBM342102
Synonyms:
1-(3-(tert-Butyl)-1-methyl-1H-pyrazol-5-yl)-3-(4-((2-((3-methoxy-5-(2-(2-(2-methoxy-ethoxy)ethoxy)ethoxy)phenyl)amino)pyrimidin-4-yl)oxy)naphthalen-1-yl)urea | US9771353, Example 2
Type:
Small organic molecule
Emp. Form.:
C37H45N7O7
Mol. Mass.:
699.7959
SMILES:
COCCOCCOCCOc1cc(Nc2nccc(Oc3ccc(NC(=O)Nc4cc(nn4C)C(C)(C)C)c4ccccc34)n2)cc(OC)c1
: