Target
Mitogen-activated protein kinase 12
Ligand
BDBM342109
Substrate
Meas. Tech.
Enzyme Inhibition
IC50
66.0±n/a nM
Citation
 Fyfe, MC Kinase inhibitors based upon N-alkyl pyrazoles US Patent  US9771353 Publication Date 9/26/2017 
Target
Name:
Mitogen-activated protein kinase 12
Synonyms:
ERK6 MAPK12 Mitogen-activated protein kinase 12 (MAPK12 p38 gamma) Mitogen-activated protein kinase 12 Gamma SAPK3 | p38 delta/gamma
Type:
Protein
Mol. Mass.:
41938.69
Organism:
Homo sapiens (Human)
Description:
P53778
Residue:
367
  
Inhibitor
Name:
BDBM342109
Synonyms:
3-((4-((4-(3-(3-(tert-Butyl)-1-methyl-1H-pyrazol-5-yl)ureido)naphthalen-1-yl)oxy)pyridin-2-yl)amino)-5-ethynyl-N-(2-(2-(2-methoxyethoxy)ethoxy)ethyl)benzamide | US9771353, Example 9
Type:
Small organic molecule
Emp. Form.:
C40H45N7O6
Mol. Mass.:
719.8286
SMILES:
COCCOCCOCCNC(=O)c1cc(Nc2cc(Oc3ccc(NC(=O)Nc4cc(nn4C)C(C)(C)C)c4ccccc34)ccn2)cc(c1)C#C
: