Target
Transient receptor potential cation channel subfamily V member 1
Ligand
BDBM342115
Substrate
Meas. Tech.
FLIPR Assay
Ki
1.40±n/a nM
Citation
 Frank-Foltyn, RHabermann, CBahrenberg, GLesch, BDamann, NSchiene, KStockhausen, HChristoph, TFrormann, SSaunders, DLee, J Substituted oxazole- and thiazole-based carboxamide and urea derivatives as vanilloid receptor ligands II US Patent  US9771359 Publication Date 9/26/2017 
Target
Name:
Transient receptor potential cation channel subfamily V member 1
Synonyms:
Capsaicin receptor Osm-9-like TRP channel 1 TRPV1_HUMAN Transient receptor potential cation channel subfamily V member 1 (TRPV1) Transient receptor potential cation channel subfamily V member 1(TRPV1) Vanilloid VR1 Vanilloid receptor 1 Vanilloid receptor 1 (VRI/TRPV1)
Type:
Protein
Mol. Mass.:
94960.75
Organism:
Homo sapiens (Human)
Description:
Q8NER1
Residue:
839
  
Inhibitor
Name:
BDBM342115
Synonyms:
N-((4-(3-chlorophenyl)-2-(trifluoromethyl)thiazol-5-yl)methyl)-2-(3-fluoro-4-(2-hydroxyethyl)phenyl)-propanamide | US9771359, EX-01
Type:
Small organic molecule
Emp. Form.:
C22H19ClF4N2O2S
Mol. Mass.:
486.91
SMILES:
CC(C(=O)NCc1sc(nc1-c1cccc(Cl)c1)C(F)(F)F)c1ccc(CCO)c(F)c1
: