Target
Mast/stem cell growth factor receptor Kit
Ligand
BDBM342162
Substrate
Meas. Tech.
Biochemical Assay
Ki
500±n/a nM
Citation
 Lin, JPham, PBuell, JSpevak, W Compounds and methods for kinase modulation, and indications therefor US Patent  US9771369 Publication Date 9/26/2017 
Target
Name:
Mast/stem cell growth factor receptor Kit
Synonyms:
CD117 antigen KIT Mast/stem cell growth factor receptor Kit (cKIT) Proto-oncogene tyrosine-protein kinase Kit Stem cell growth factor receptor Tyrosine-protein kinase Kit c-kit v-kit Hardy-Zuckerman 4 feline sarcoma viral oncogene homolog
Type:
Protein
Mol. Mass.:
109869.37
Organism:
Homo sapiens (Human)
Description:
P10721
Residue:
976
  
Inhibitor
Name:
BDBM342162
Synonyms:
4-[4-(4-cyclopropyl-5-phenyl-1H- imidazol-2-yl)-1-piperidyl]-6-(2- methoxy-4-pyridyl)-7H-pyrrolo[2,3- d]pyrimidine | US9771369, Compound P-3008
Type:
Small organic molecule
Emp. Form.:
C29H29N7O
Mol. Mass.:
491.5869
SMILES:
COc1cc(ccn1)-c1cc2c(ncnc2[nH]1)N1CCC(CC1)c1nc(C2CC2)c([nH]1)-c1ccccc1
: