Target
Mast/stem cell growth factor receptor Kit
Ligand
BDBM342292
Substrate
Meas. Tech.
Biochemical Assay
Ki
500±n/a nM
Citation
 Lin, JPham, PBuell, JSpevak, W Compounds and methods for kinase modulation, and indications therefor US Patent  US9771369 Publication Date 9/26/2017 
Target
Name:
Mast/stem cell growth factor receptor Kit
Synonyms:
CD117 antigen KIT Mast/stem cell growth factor receptor Kit (cKIT) Proto-oncogene tyrosine-protein kinase Kit Stem cell growth factor receptor Tyrosine-protein kinase Kit c-kit v-kit Hardy-Zuckerman 4 feline sarcoma viral oncogene homolog
Type:
Protein
Mol. Mass.:
109869.37
Organism:
Homo sapiens (Human)
Description:
P10721
Residue:
976
  
Inhibitor
Name:
BDBM342292
Synonyms:
4-[4-[4-[5-(3-methoxyphenyl)-4- (trifluoromethyl)-1H-imidazol-2-yl]-1- piperidyl]-7H-pyrrolo[2,3-d]pyrimidin- 6-yl]benzonitrile | US9771369, Compound P-3124
Type:
Small organic molecule
Emp. Form.:
C29H24F3N7O
Mol. Mass.:
543.5424
SMILES:
COc1cccc(c1)-c1[nH]c(nc1C(F)(F)F)C1CCN(CC1)c1ncnc2[nH]c(cc12)-c1ccc(cc1)C#N
: