Target
Ketohexokinase
Ligand
BDBM50349732
Substrate
Meas. Tech.
Enzyme Assay
IC50
220±n/a nM
Citation
 Zhang, XAbad, MCGibbs, ACKuo, GSong, FSui, ZKuo, LC Indazole compounds useful as ketohexokinase inhibitors US Patent  US9771375 Publication Date 9/26/2017 
Target
Name:
Ketohexokinase
Synonyms:
Hepatic fructokinase KHK_HUMAN Ketohexokinase (KHK) | Ketohexokinase (KHK) Isoform C
Type:
Enzyme Catalytic Domain
Mol. Mass.:
32521.64
Organism:
Homo sapiens (Human)
Description:
Residue:
298
  
Inhibitor
Name:
BDBM50349732
Synonyms:
CHEMBL1809159 US9771375, Example 2
Type:
Small organic molecule
Emp. Form.:
C18H18N4OS
Mol. Mass.:
338.427
SMILES:
CSc1nn(-c2ccccc2)c2cc(NC(=O)C3CNC3)ccc12
: