Target
Ketohexokinase
Ligand
BDBM130551
Substrate
Meas. Tech.
Enzyme Assay
IC50
560±n/a nM
Citation
 Zhang, XAbad, MCGibbs, ACKuo, GSong, FSui, ZKuo, LC Indazole compounds useful as ketohexokinase inhibitors US Patent  US9771375 Publication Date 9/26/2017 
Target
Name:
Ketohexokinase
Synonyms:
Hepatic fructokinase KHK_HUMAN Ketohexokinase (KHK) | Ketohexokinase (KHK) Isoform C
Type:
Enzyme Catalytic Domain
Mol. Mass.:
32521.64
Organism:
Homo sapiens (Human)
Description:
Residue:
298
  
Inhibitor
Name:
BDBM130551
Synonyms:
US8822447, 15 | US9771375, Example 15
Type:
Small organic molecule
Emp. Form.:
C21H25N5S
Mol. Mass.:
379.522
SMILES:
CSc1nn(-c2ccccc2)c2cc(ccc12)N1CC(C1)N1CCNCC1
: