Target
Ketohexokinase
Ligand
BDBM130561
Substrate
Meas. Tech.
Enzyme Assay
IC50
1470±n/a nM
Citation
 Zhang, XAbad, MCGibbs, ACKuo, GSong, FSui, ZKuo, LC Indazole compounds useful as ketohexokinase inhibitors US Patent  US9771375 Publication Date 9/26/2017 
Target
Name:
Ketohexokinase
Synonyms:
Hepatic fructokinase KHK_HUMAN Ketohexokinase (KHK) | Ketohexokinase (KHK) Isoform C
Type:
Enzyme Catalytic Domain
Mol. Mass.:
32521.64
Organism:
Homo sapiens (Human)
Description:
Residue:
298
  
Inhibitor
Name:
BDBM130561
Synonyms:
US8822447, 26 | US9771375, Example 26
Type:
Small organic molecule
Emp. Form.:
C22H25N5OS
Mol. Mass.:
407.532
SMILES:
CSc1nn(-c2ccccc2)c2cc(ccc12)N1CCN(C2CCNCC2)C1=O
: