Target
Ketohexokinase
Ligand
BDBM50349759
Substrate
Meas. Tech.
Enzyme Assay
IC50
680±n/a nM
Citation
 Zhang, XAbad, MCGibbs, ACKuo, GSong, FSui, ZKuo, LC Indazole compounds useful as ketohexokinase inhibitors US Patent  US9771375 Publication Date 9/26/2017 
Target
Name:
Ketohexokinase
Synonyms:
Hepatic fructokinase KHK_HUMAN Ketohexokinase (KHK) | Ketohexokinase (KHK) Isoform C
Type:
Enzyme Catalytic Domain
Mol. Mass.:
32521.64
Organism:
Homo sapiens (Human)
Description:
Residue:
298
  
Inhibitor
Name:
BDBM50349759
Synonyms:
CHEMBL1809186 US9771375, Example 40
Type:
Small organic molecule
Emp. Form.:
C23H21N5O
Mol. Mass.:
383.4457
SMILES:
CCc1nn(-c2ccccc2)c2cc(NC(=O)c3cccc(c3)C(N)=N)ccc12
: