Target
Ketohexokinase
Ligand
BDBM50349750
Substrate
Meas. Tech.
Enzyme Assay
IC50
570±n/a nM
Citation
 Zhang, XAbad, MCGibbs, ACKuo, GSong, FSui, ZKuo, LC Indazole compounds useful as ketohexokinase inhibitors US Patent  US9771375 Publication Date 9/26/2017 
Target
Name:
Ketohexokinase
Synonyms:
Hepatic fructokinase KHK_HUMAN Ketohexokinase (KHK) | Ketohexokinase (KHK) Isoform C
Type:
Enzyme Catalytic Domain
Mol. Mass.:
32521.64
Organism:
Homo sapiens (Human)
Description:
Residue:
298
  
Inhibitor
Name:
BDBM50349750
Synonyms:
CHEMBL1809177 US9771375, Example 42
Type:
Small organic molecule
Emp. Form.:
C19H22N4
Mol. Mass.:
306.4048
SMILES:
CCc1nn(-c2ccccc2)c2cc(ccc12)N1CCNCC1
: