Target
Ketohexokinase
Ligand
BDBM50349758
Substrate
Meas. Tech.
Enzyme Assay
IC50
9800±n/a nM
Citation
 Zhang, XAbad, MCGibbs, ACKuo, GSong, FSui, ZKuo, LC Indazole compounds useful as ketohexokinase inhibitors US Patent  US9771375 Publication Date 9/26/2017 
Target
Name:
Ketohexokinase
Synonyms:
Hepatic fructokinase KHK_HUMAN Ketohexokinase (KHK) | Ketohexokinase (KHK) Isoform C
Type:
Enzyme Catalytic Domain
Mol. Mass.:
32521.64
Organism:
Homo sapiens (Human)
Description:
Residue:
298
  
Inhibitor
Name:
BDBM50349758
Synonyms:
CHEMBL1809185 US9771375, Example 52
Type:
Small organic molecule
Emp. Form.:
C25H26N4
Mol. Mass.:
382.5007
SMILES:
CCc1nn(-c2ccccc2)c2cc(ccc12)-c1ccc(cc1)N1CCNCC1
: