Target
Ketohexokinase
Ligand
BDBM50349748
Substrate
Meas. Tech.
Enzyme Assay
IC50
3200±n/a nM
Citation
 Zhang, XAbad, MCGibbs, ACKuo, GSong, FSui, ZKuo, LC Indazole compounds useful as ketohexokinase inhibitors US Patent  US9771375 Publication Date 9/26/2017 
Target
Name:
Ketohexokinase
Synonyms:
Hepatic fructokinase KHK_HUMAN Ketohexokinase (KHK) | Ketohexokinase (KHK) Isoform C
Type:
Enzyme Catalytic Domain
Mol. Mass.:
32521.64
Organism:
Homo sapiens (Human)
Description:
Residue:
298
  
Inhibitor
Name:
BDBM50349748
Synonyms:
CHEMBL1809175 | US9771375, Example 57
Type:
Small organic molecule
Emp. Form.:
C23H29N5
Mol. Mass.:
375.5099
SMILES:
Cc1nn(-c2ccccc2)c2cc(ccc12)N1CCC(CC1)N1CCNCC1
: