Target
Ketohexokinase
Ligand
BDBM342491
Substrate
Meas. Tech.
Enzyme Assay
IC50
390±n/a nM
Citation
 Zhang, XAbad, MCGibbs, ACKuo, GSong, FSui, ZKuo, LC Indazole compounds useful as ketohexokinase inhibitors US Patent  US9771375 Publication Date 9/26/2017 
Target
Name:
Ketohexokinase
Synonyms:
Hepatic fructokinase KHK_HUMAN Ketohexokinase (KHK) | Ketohexokinase (KHK) Isoform C
Type:
Enzyme Catalytic Domain
Mol. Mass.:
32521.64
Organism:
Homo sapiens (Human)
Description:
Residue:
298
  
Inhibitor
Name:
BDBM342491
Synonyms:
3-Methoxy-1-phenyl-6-(3-(piperazin-1-yl)azetidin-1-yl)-1H-indazole hydrochloride | US9771375, Example 73
Type:
Small organic molecule
Emp. Form.:
C21H25N5O
Mol. Mass.:
363.4561
SMILES:
COc1nn(-c2ccccc2)c2cc(ccc12)N1CN(C1)C1CCNCC1
: