Target
Ketohexokinase
Ligand
BDBM50349734
Substrate
Meas. Tech.
Enzyme Assay
IC50
380±n/a nM
Citation
 Zhang, XAbad, MCGibbs, ACKuo, GSong, FSui, ZKuo, LC Indazole compounds useful as ketohexokinase inhibitors US Patent  US9771375 Publication Date 9/26/2017 
Target
Name:
Ketohexokinase
Synonyms:
Hepatic fructokinase KHK_HUMAN Ketohexokinase (KHK) | Ketohexokinase (KHK) Isoform C
Type:
Enzyme Catalytic Domain
Mol. Mass.:
32521.64
Organism:
Homo sapiens (Human)
Description:
Residue:
298
  
Inhibitor
Name:
BDBM50349734
Synonyms:
CHEMBL1809161 US9771375, Example 132
Type:
Small organic molecule
Emp. Form.:
C21H25N5OS
Mol. Mass.:
395.521
SMILES:
CSc1nn(-c2ccccc2)c2cc(NC(=O)CCN3CCNCC3)ccc12
: