Target
Ketohexokinase
Ligand
BDBM130639
Substrate
Meas. Tech.
Enzyme Assay
IC50
>51000±n/a nM
Citation
 Zhang, XAbad, MCGibbs, ACKuo, GSong, FSui, ZKuo, LC Indazole compounds useful as ketohexokinase inhibitors US Patent  US9771375 Publication Date 9/26/2017 
Target
Name:
Ketohexokinase
Synonyms:
Hepatic fructokinase KHK_HUMAN Ketohexokinase (KHK) | Ketohexokinase (KHK) Isoform C
Type:
Enzyme Catalytic Domain
Mol. Mass.:
32521.64
Organism:
Homo sapiens (Human)
Description:
Residue:
298
  
Inhibitor
Name:
BDBM130639
Synonyms:
US8822447, 133 | US9771375, Example 133
Type:
Small organic molecule
Emp. Form.:
C19H19N5O3S
Mol. Mass.:
397.451
SMILES:
CSc1nn(-c2ccc(cc2)[N+]([O-])=O)c2cc(ccc12)C(=O)N1CCNCC1
: