Target
Ketohexokinase
Ligand
BDBM130641
Substrate
Meas. Tech.
Enzyme Assay
IC50
>2000±n/a nM
Citation
 Zhang, XAbad, MCGibbs, ACKuo, GSong, FSui, ZKuo, LC Indazole compounds useful as ketohexokinase inhibitors US Patent  US9771375 Publication Date 9/26/2017 
Target
Name:
Ketohexokinase
Synonyms:
Hepatic fructokinase KHK_HUMAN Ketohexokinase (KHK) | Ketohexokinase (KHK) Isoform C
Type:
Enzyme Catalytic Domain
Mol. Mass.:
32521.64
Organism:
Homo sapiens (Human)
Description:
Residue:
298
  
Inhibitor
Name:
BDBM130641
Synonyms:
US8822447, 136 | US9771375, Example 136
Type:
Small organic molecule
Emp. Form.:
C20H23N3OS
Mol. Mass.:
353.481
SMILES:
CSc1nn(-c2ccccc2)c2cc(ccc12)C(O)C1CCNCC1
: