Target
Sodium channel protein type 5 subunit alpha
Ligand
BDBM145229
Substrate
Meas. Tech.
Electrophysiological Assay (In Vitro Assay)
IC50
1068±n/a nM
Citation
 Chowdhury, SDehnhardt, CMFocken, TGrimwood, MEHemeon, IWJia, QOrtwine, DFSafina, BSun, SSutherlin, DPZenova, AY N-substituted benzamides and methods of use thereof US Patent  US9771376 Publication Date 9/26/2017 
Target
Name:
Sodium channel protein type 5 subunit alpha
Synonyms:
HH1 SCN5A_HUMAN Sodium channel protein type 5 subunit alpha/beta-1/beta-2 Voltage-gated sodium channel subunit alpha Nav1.5
Type:
Enzyme
Mol. Mass.:
226908.60
Organism:
Homo sapiens (Human)
Description:
Q14524
Residue:
2016
  
Inhibitor
Name:
BDBM145229
Synonyms:
US8952169, 8 | US9771376, Example 8
Type:
Small organic molecule
Emp. Form.:
C18H23ClFNO4S
Mol. Mass.:
403.896
SMILES:
CC1(C)[C@@H]2C[C@H]1[C@@H](COc1cc(F)c(cc1Cl)C(=O)NS(C)(=O)=O)CC2
: