Target
Beta-secretase 1
Ligand
BDBM342420
Substrate
Meas. Tech.
Cell-Free Assay
IC50
214±n/a nM
Citation
 Brodney, MAButler, CRZhang, LO Neill, BT N-(2-(2-amino-6-substituted-4,4a,5,6-tetrahydropyrano[3,4-d][1,3]OXAZIN-8a(8H)-yl)-thiazol-4-yl) amides US Patent  US9771379 Publication Date 9/26/2017 
Target
Name:
Beta-secretase 1
Synonyms:
ASP2 Aspartyl protease 2 BACE1 Beta-secretase (BACE) Beta-secretase 1 (BACE 1) Beta-secretase 1 (BACE1) Beta-site amyloid precursor protein cleaving enzyme 1 Memapsin-2 beta-Secretase (BACE-1) | beta-Secretase (BACE1)
Type:
Protein
Mol. Mass.:
55755.10
Organism:
Homo sapiens (Human)
Description:
P56817
Residue:
501
  
Inhibitor
Name:
BDBM342420
Synonyms:
N-(2-((4aR,6S,8aR)-2-amino-6-methyl-4,4a,5,6-tetrahydropyrano[3,4-d][1,3]oxazin-8a(8H)-yl)thiazol-4-yl)-5-(difluoromethoxy)picolinamide | US9771379, Example 1
Type:
Small organic molecule
Emp. Form.:
C18H19F2N5O4S
Mol. Mass.:
439.436
SMILES:
C[C@H]1C[C@H]2COC(N)=N[C@]2(CO1)c1nc(NC(=O)c2ccc(OC(F)F)cn2)cs1
: