Target
cAMP-specific 3',5'-cyclic phosphodiesterase 4A
Ligand
BDBM14373
Substrate
BDBM10851
Meas. Tech.
PDE Activity Assay
pH
8±n/a
Temperature
295.15±n/a K
Ki
405±8 nM
Citation
 Whitehead, JWLee, GPGharagozloo, PHofer, PGehrig, AWintergerst, PSmyth, DMcCoull, WHachicha, MPatel, AKyle, DJ 8-Substituted analogues of 3-(3-cyclopentyloxy-4-methoxy-benzyl)-8-isopropyladenine: highly potent and selective PDE4 inhibitors. J Med Chem 48:1237-43 (2005)  
Target
Name:
cAMP-specific 3',5'-cyclic phosphodiesterase 4A
Synonyms:
3',5'-cyclic phosphodiesterase PDE46 PDE4A_HUMAN Phosphodiesterase 4A | Phosphodiesterase 4A (PDE4)
Type:
Enzyme
Mol. Mass.:
98113.27
Organism:
Homo sapiens (Human)
Description:
P27815
Residue:
886
  
Inhibitor
Name:
BDBM14373
Synonyms:
(2E)-but-2-enedioic acid; 3-{[3-(cyclopentyloxy)-4-methoxyphenyl]methyl}-8-{2-[(3,4-dimethoxyphenyl)methoxy]propan-2-yl}-3H-purin-6-amine V11294 Analogue 5i
Type:
Small organic molecule
Emp. Form.:
C30H37N5O5
Mol. Mass.:
547.6453
SMILES:
COc1ccc(COC(C)(C)c2nc3c(N)ncn(Cc4ccc(OC)c(OC5CCCC5)c4)c3n2)cc1OC
:
Substrate
Name:
BDBM10851
Synonyms:
(4aR,6R,7R,7aS)-6-(6-amino-9H-purin-9-yl)-2,7-dihydroxy-hexahydro-1,3,5,2-furo[3,2-d][1,3,2]dioxaphosphinin-2-one ADENOSINE-3 ,5 -CYCLIC-MONOPHOSPHATE cAMP | cid_23902375
Type:
Small organic molecule
Emp. Form.:
C10H12N5O6P
Mol. Mass.:
329.2059
SMILES:
Nc1ncnc2n(cnc12)[C@@H]1O[C@@H]2COP(O)(=O)O[C@H]2[C@H]1O
: