Target
cAMP-specific 3',5'-cyclic phosphodiesterase 4A
Ligand
BDBM14385
Substrate
BDBM10851
Meas. Tech.
PDE Activity Assay
pH
8±n/a
Temperature
295.15±n/a K
Ki
236±65 nM
Citation
 Whitehead, JWLee, GPGharagozloo, PHofer, PGehrig, AWintergerst, PSmyth, DMcCoull, WHachicha, MPatel, AKyle, DJ 8-Substituted analogues of 3-(3-cyclopentyloxy-4-methoxy-benzyl)-8-isopropyladenine: highly potent and selective PDE4 inhibitors. J Med Chem 48:1237-43 (2005)  
Target
Name:
cAMP-specific 3',5'-cyclic phosphodiesterase 4A
Synonyms:
3',5'-cyclic phosphodiesterase PDE46 PDE4A_HUMAN Phosphodiesterase 4A | Phosphodiesterase 4A (PDE4)
Type:
Enzyme
Mol. Mass.:
98113.27
Organism:
Homo sapiens (Human)
Description:
P27815
Residue:
886
  
Inhibitor
Name:
BDBM14385
Synonyms:
3-(3-Cyclopentyloxy-4-methoxy-benzyl)-8-[1,1-dimethyl-2-(thiophen-2-yloxy)-ethyl]-3H-purin-6-ylamine V11294 Analogue 5u
Type:
Small organic molecule
Emp. Form.:
C26H31N5O3S
Mol. Mass.:
493.621
SMILES:
COc1ccc(Cn2cnc(N)c3nc(nc23)C(C)(C)COc2cccs2)cc1OC1CCCC1
:
Substrate
Name:
BDBM10851
Synonyms:
(4aR,6R,7R,7aS)-6-(6-amino-9H-purin-9-yl)-2,7-dihydroxy-hexahydro-1,3,5,2-furo[3,2-d][1,3,2]dioxaphosphinin-2-one ADENOSINE-3 ,5 -CYCLIC-MONOPHOSPHATE cAMP | cid_23902375
Type:
Small organic molecule
Emp. Form.:
C10H12N5O6P
Mol. Mass.:
329.2059
SMILES:
Nc1ncnc2n(cnc12)[C@@H]1O[C@@H]2COP(O)(=O)O[C@H]2[C@H]1O
: