Target
Tyrosine-protein kinase SYK
Ligand
BDBM339983
Substrate
Meas. Tech.
Homogeneous Time-Resolved Fluorescence (HTRF) Assay
IC50
1.3±n/a nM
Citation
 Altman, MDCash, BEllis, JMMaddess, MLNorthrup, ABOtte, RDSun, B 2-pyrazine carboxamides as spleen tyrosine kinase inhibitors US Patent  US9775839 Publication Date 10/3/2017 
Target
Name:
Tyrosine-protein kinase SYK
Synonyms:
KSYK_HUMAN Spleen Tyrosine Kinase Tyrosine-protein kinase SYK (Syk)
Type:
Enzyme
Mol. Mass.:
72079.99
Organism:
Homo sapiens (Human)
Description:
P43405
Residue:
635
  
Inhibitor
Name:
BDBM339983
Synonyms:
5-{[(3S,4S)-4-amino-1,1- dioxidotetrahydro-2H- thiopyran-3-yl]amino}-3- (4-chloro-1H-indol-2- yl)pyrazine-2- carboxamide | US9775839, 7.7
Type:
Small organic molecule
Emp. Form.:
C18H19ClN6O3S
Mol. Mass.:
434.9
SMILES:
N[C@H]1CCS(=O)(=O)C[C@H]1Nc1cnc(C(N)=O)c(n1)-c1cc2c(Cl)cccc2[nH]1
: