Target
Tyrosine-protein kinase SYK
Ligand
BDBM339989
Substrate
Meas. Tech.
Homogeneous Time-Resolved Fluorescence (HTRF) Assay
IC50
1.3±n/a nM
Citation
 Altman, MDCash, BEllis, JMMaddess, MLNorthrup, ABOtte, RDSun, B 2-pyrazine carboxamides as spleen tyrosine kinase inhibitors US Patent  US9775839 Publication Date 10/3/2017 
Target
Name:
Tyrosine-protein kinase SYK
Synonyms:
KSYK_HUMAN Spleen Tyrosine Kinase Tyrosine-protein kinase SYK (Syk)
Type:
Enzyme
Mol. Mass.:
72079.99
Organism:
Homo sapiens (Human)
Description:
P43405
Residue:
635
  
Inhibitor
Name:
BDBM339989
Synonyms:
5-{[(1R,2S)-2- aminocyclohexyl]amino}- 3-(4-methyl-1H-indol-2- yl)pyrazine-2- carboxamide | US9775839, 8.3
Type:
Small organic molecule
Emp. Form.:
C20H24N6O
Mol. Mass.:
364.4442
SMILES:
Cc1cccc2[nH]c(cc12)-c1nc(N[C@@H]2CCCC[C@@H]2N)cnc1C(N)=O
: