Target
Tyrosine-protein kinase SYK
Ligand
BDBM340000
Substrate
Meas. Tech.
Homogeneous Time-Resolved Fluorescence (HTRF) Assay
IC50
0.2±n/a nM
Citation
 Altman, MDCash, BEllis, JMMaddess, MLNorthrup, ABOtte, RDSun, B 2-pyrazine carboxamides as spleen tyrosine kinase inhibitors US Patent  US9775839 Publication Date 10/3/2017 
Target
Name:
Tyrosine-protein kinase SYK
Synonyms:
KSYK_HUMAN Spleen Tyrosine Kinase Tyrosine-protein kinase SYK (Syk)
Type:
Enzyme
Mol. Mass.:
72079.99
Organism:
Homo sapiens (Human)
Description:
P43405
Residue:
635
  
Inhibitor
Name:
BDBM340000
Synonyms:
5-{[(3R,4R)-3- aminotetrahydro-2H-pyran-4- yl]amino}-3-(5-ethyl-1H- indol-2-yl)pyrazine-2- carboxamide | US9775839, 10.5
Type:
Small organic molecule
Emp. Form.:
C20H24N6O2
Mol. Mass.:
380.4436
SMILES:
CCc1ccc2[nH]c(cc2c1)-c1nc(N[C@@H]2CCOC[C@@H]2N)cnc1C(N)=O
: