Target
Phosphatidylinositol 4,5-bisphosphate 3-kinase catalytic subunit beta isoform
Ligand
BDBM342541
Substrate
Meas. Tech.
Inhibition Assays
IC50
2000±n/a nM
Citation
 Kutok, JLWinkler, DGPalombella, VJCastro, ACEvans, CAJanardanannair, SLescarbeau, ALiu, TTremblay, MR Heterocyclic compounds and uses thereof US Patent  US9775844 Publication Date 10/3/2017 
Target
Name:
Phosphatidylinositol 4,5-bisphosphate 3-kinase catalytic subunit beta isoform
Synonyms:
PI3-kinase p110 subunit beta PI3Kbeta PIK3CB Phosphatidylinositol 4,5-bisphosphate 3-kinase catalytic subunit beta (PI3Kbeta) Phosphatidylinositol 4,5-bisphosphate 3-kinase catalytic subunit beta isoform (PI3K) Phosphatidylinositol 4,5-bisphosphate 3-kinase catalytic subunit beta isoform (PI3Kbeta) Phosphatidylinositol-4,5-bisphosphate 3-kinase catalytic subunit beta isoform Phosphoinositide 3-Kinase (PI3K), beta Chain A PtdIns-3-kinase p110
Type:
Enzyme Subunit
Mol. Mass.:
122769.00
Organism:
Homo sapiens (Human)
Description:
P42338
Residue:
1070
  
Inhibitor
Name:
BDBM342541
Synonyms:
US10329299, Compound 92 US11541059, Compound 92 | US9775844, Compound 92
Type:
Small organic molecule
Emp. Form.:
C29H24N8O3
Mol. Mass.:
532.5527
SMILES:
C[C@H](NC(=O)c1c(N)nn2cccnc12)c1cc2cccc(CC(=O)c3cn[nH]c3)c2c(=O)n1-c1ccccc1
: