Target
Phosphatidylinositol 4,5-bisphosphate 3-kinase catalytic subunit alpha isoform
Ligand
BDBM342553
Substrate
Meas. Tech.
Inhibition Assays
IC50
2000±n/a nM
Citation
 Kutok, JLWinkler, DGPalombella, VJCastro, ACEvans, CAJanardanannair, SLescarbeau, ALiu, TTremblay, MR Heterocyclic compounds and uses thereof US Patent  US9775844 Publication Date 10/3/2017 
Target
Name:
Phosphatidylinositol 4,5-bisphosphate 3-kinase catalytic subunit alpha isoform
Synonyms:
P42336 PI3-kinase subunit p110-alpha PIK3CA Phosphatidylinositol 3-kinase alpha (PI3Kalpha) Phosphatidylinositol 4,5-bisphosphate 3-kinase (PI3K) Phosphatidylinositol 4,5-bisphosphate 3-kinase catalytic subunit alpha (PI3Kalpha) Phosphatidylinositol 4,5-bisphosphate 3-kinase catalytic subunit alpha isoform (PI3-Ka) Phosphatidylinositol 4,5-bisphosphate 3-kinase catalytic subunit alpha isoform (PI3K p110alpha) Phosphatidylinositol 4,5-bisphosphate 3-kinase catalytic subunit alpha isoform (PI3K-alpha) Phosphatidylinositol 4,5-bisphosphate 3-kinase catalytic subunit alpha isoform (PI3Kalpha p110alpha) Phosphatidylinositol 4,5-bisphosphate 3-kinase catalytic subunit alpha isoform (PIK3CA) Phosphatidylinositol-4,5-bisphosphate 3-kinase catalytic subunit alpha isoform Phosphoinositide 3-Kinase (PI3K), alpha Chain A Phosphoinositide 3-kinases (PI3K) PtdIns-3-kinase p110 | p110 alpha
Type:
Enzyme Subunit
Mol. Mass.:
124294.87
Organism:
Homo sapiens (Human)
Description:
P42336
Residue:
1068
  
Inhibitor
Name:
BDBM342553
Synonyms:
US10329299, Compound 104 US11541059, Compound 104 | US9775844, Compound 104
Type:
Small organic molecule
Emp. Form.:
C28H29N9O4S
Mol. Mass.:
587.653
SMILES:
C[C@H](NC(=O)c1c(N)nn2cccnc12)c1cc2cccc(C#Cc3cnn(C)c3)c2c(=O)n1CCS(=O)(=O)N(C)C
: