Target
Mitogen-activated protein kinase 1
Ligand
BDBM204809
Substrate
Meas. Tech.
Active Human ERK2 (hERK2) Activity Assay
IC50
8.64±0 nM
Citation
 Lipford, KFalcone, DSloman, DLWitter, DJ ERK inhibitors US Patent  US9546168 Publication Date 1/17/2017 
Target
Name:
Mitogen-activated protein kinase 1
Synonyms:
ERK2 Extracellular signal-regulated kinase 2 Extracellular signal-regulated kinase 2 (ERK2) MAPK 2 MK01_HUMAN Mitogen-activated protein kinase 1 (ERK-2) Mitogen-activated protein kinase 2 PRKM2 | p42-MAPK
Type:
Ser/Thr Protein Kinase
Mol. Mass.:
41392.76
Organism:
Homo sapiens (Human)
Description:
P28482
Residue:
360
  
Inhibitor
Name:
BDBM204809
Synonyms:
US9546168, ex 17
Type:
Small organic molecule
Emp. Form.:
C25H26FN5O2
Mol. Mass.:
447.5046
SMILES:
CC(C)(C)[C@@H](NC(=O)Nc1cc2[nH]nc(-c3ccc(F)cc3)c2c(CO)n1)c1ccccc1
: