Target
Lysine-specific histone demethylase 1A
Ligand
BDBM283254
Substrate
Meas. Tech.
In Vitro Enzyme Inhibition Assay
IC50
550±n/a nM
Citation
 Chen, YKKanouni, TKaldor, SWStafford, JAVeal, JM Inhibitors of lysine specific demethylase-1 US Patent  US9776974 Publication Date 10/3/2017 
Target
Name:
Lysine-specific histone demethylase 1A
Synonyms:
AOF2 Flavin-containing amine oxidase domain-containing protein 2 KDM1A KIAA0601 Lysine-specific demethylase 1 (LSD1) Lysine-specific histone demethylase 1 (LSD1)
Type:
Enzyme
Mol. Mass.:
92901.01
Organism:
Homo sapiens (Human)
Description:
O60341
Residue:
852
  
Inhibitor
Name:
BDBM283254
Synonyms:
4-[2-(4-aminopiperidyl)-6-(4- cyano-3-fluorophenyl)-3-methyl- 4-oxo-3-hydropyrimidin-5-yl] benzoic acid US10207999, Example 39 US10548896, Example 39 US10960005, Example 39 US9573930, Example 39 US9776974, Example 39
Type:
Small organic molecule
Emp. Form.:
C24H22FN5O3
Mol. Mass.:
447.4616
SMILES:
Cn1c(nc(-c2ccc(C#N)c(F)c2)c(-c2ccc(cc2)C(O)=O)c1=O)N1CCC(N)CC1
: