Target
Lysine-specific histone demethylase 1A
Ligand
BDBM283305
Substrate
Meas. Tech.
In Vitro Enzyme Inhibition Assay
IC50
<100±n/a nM
Citation
 Chen, YKKanouni, TKaldor, SWStafford, JAVeal, JM Inhibitors of lysine specific demethylase-1 US Patent  US9776974 Publication Date 10/3/2017 
Target
Name:
Lysine-specific histone demethylase 1A
Synonyms:
AOF2 Flavin-containing amine oxidase domain-containing protein 2 KDM1A KIAA0601 Lysine-specific demethylase 1 (LSD1) Lysine-specific histone demethylase 1 (LSD1)
Type:
Enzyme
Mol. Mass.:
92901.01
Organism:
Homo sapiens (Human)
Description:
O60341
Residue:
852
  
Inhibitor
Name:
BDBM283305
Synonyms:
4-[2-(4-dimethylamino-piperidin-1- yl)-5-(2H-indazol-6-yl)-1-methyl- 6-oxo-1,6-dihydro-pyrimidin-4-yl]- 2-fluoro-benzonitrile US10207999, Example 84 US10548896, Example 84 US10960005, Example 84 US9771329, Example 84 | US9776974, Example 84
Type:
Small organic molecule
Emp. Form.:
C26H26FN7O
Mol. Mass.:
471.5293
SMILES:
CN(C)C1CCN(CC1)c1nc(-c2ccc(C#N)c(F)c2)c(-c2ccc3cn[nH]c3c2)c(=O)n1C
: