Target
Lysine-specific histone demethylase 1A
Ligand
BDBM289961
Substrate
Meas. Tech.
In Vitro Enzyme Inhibition Assay
IC50
<100±n/a nM
Citation
 Chen, YKKanouni, TKaldor, SWStafford, JAVeal, JM Inhibitors of lysine specific demethylase-1 US Patent  US9776974 Publication Date 10/3/2017 
Target
Name:
Lysine-specific histone demethylase 1A
Synonyms:
AOF2 Flavin-containing amine oxidase domain-containing protein 2 KDM1A KIAA0601 Lysine-specific demethylase 1 (LSD1) Lysine-specific histone demethylase 1 (LSD1)
Type:
Enzyme
Mol. Mass.:
92901.01
Organism:
Homo sapiens (Human)
Description:
O60341
Residue:
852
  
Inhibitor
Name:
BDBM289961
Synonyms:
4-[2-(4-aminopiperidin- 1-yl)-5-(3,4-difluorophenyl)- 1-methyl-6-oxopyrimidin- 4-yl]-2-fluorobenzonitrile US10328077, Example 104 US10849898, Example 104 US11084793, Example 104 US9771329, Example 104 | US9776974, Example 104
Type:
Small organic molecule
Emp. Form.:
C23H20F3N5O
Mol. Mass.:
439.433
SMILES:
Cn1c(nc(-c2ccc(C#N)c(F)c2)c(-c2ccc(F)c(F)c2)c1=O)N1CCC(N)CC1
: